Target
Sodium-dependent serotonin transporter
Ligand
BDBM50057128
Substrate
Meas. Tech.
ChEBML_201997
Ki
4±n/a nM
Citation
 Andrés, JIAlcázar, JAlonso, JMAlvarez, RMCid, JMDe Lucas, AIFernández, JMartínez, SNieto, CPastor, JBakker, MHBiesmans, IHeylen, LIMegens, AA Synthesis of 3a,4-dihydro-3H-[1]benzopyrano[4,3-c]isoxazoles, displaying combined 5-HT uptake inhibiting and alpha(2)-adrenoceptor antagonistic activities: a novel series of potential antidepressants. Bioorg Med Chem Lett 13:2719-25 (2003)  
Target
Name:
Sodium-dependent serotonin transporter
Synonyms:
5-HT Transporter 5HT transporter Anandamid membrane transporter, AMT Monoamine transporters; Norepinephrine & serotonin Slc6a4 Sodium-dependent serotonin transporter (SERT) | imipramine receptor
Type:
Multi-pass membrane protein
Mol. Mass.:
70168.43
Organism:
Rattus norvegicus (rat)
Description:
P31652
Residue:
630
  
Inhibitor
Name:
BDBM50057128
Synonyms:
(2-Benzofuran-6-yl-ethyl)-((R)-5-methoxy-1,2,3,4-tetrahydro-naphthalen-1-ylmethyl)-methyl-amine CHEMBL268258
Type:
Small organic molecule
Emp. Form.:
C23H27NO2
Mol. Mass.:
349.466
SMILES:
COc1cccc2[C@H](CN(C)CCc3ccc4ccoc4c3)CCCc12
: