Target
Alpha-2A adrenergic receptor
Ligand
BDBM50131357
Substrate
Meas. Tech.
ChEBML_33076
Ki
5.9±n/a nM
Citation
 Andrés, JIAlcázar, JAlonso, JMAlvarez, RMCid, JMDe Lucas, AIFernández, JMartínez, SNieto, CPastor, JBakker, MHBiesmans, IHeylen, LIMegens, AA Synthesis of 3a,4-dihydro-3H-[1]benzopyrano[4,3-c]isoxazoles, displaying combined 5-HT uptake inhibiting and alpha(2)-adrenoceptor antagonistic activities: a novel series of potential antidepressants. Bioorg Med Chem Lett 13:2719-25 (2003)  
Target
Name:
Alpha-2A adrenergic receptor
Synonyms:
ADA2A_HUMAN ADRA2R Adrenergic alpha2A Alpha-2 adrenergic receptor subtype C10 Alpha-2A adrenoreceptor alpha-2A adrenergic receptor [Homo sapiens]
Type:
Enzyme
Mol. Mass.:
48979.91
Organism:
Homo sapiens (Human)
Description:
P08913
Residue:
465
  
Inhibitor
Name:
BDBM50131357
Synonyms:
4-(5-Fluoro-indan-2-ylmethyl)-4,5-dihydro-1H-imidazole S-34324
Type:
Small organic molecule
Emp. Form.:
C13H15FN2
Mol. Mass.:
218.27
SMILES:
Fc1ccc2CC(CC3CNC=N3)Cc2c1
: