Target
Apelin receptor
Ligand
BDBM50567160
Substrate
Meas. Tech.
ChEMBL_2102447 (CHEMBL4810843)
EC50
0.050000±n/a nM
Citation
 Tora, GJiang, JBostwick, JSGargalovic, PSOnorato, JMLuk, CEGeneraux, CXu, CGalella, MAWang, THe, YWexler, RRFinlay, HJ Identification of 6-hydroxy-5-phenyl sulfonylpyrimidin-4(1H)-one APJ receptor agonists. Bioorg Med Chem Lett 50:0 (2021)  
Target
Name:
Apelin receptor
Synonyms:
APJ_MOUSE Angiotensin receptor-like 1 Aplnr MSR
Type:
PROTEIN
Mol. Mass.:
42269.53
Organism:
Mus musculus
Description:
ChEMBL_120488
Residue:
377
  
Inhibitor
Name:
BDBM50567160
Synonyms:
CHEMBL4873216
Type:
Small organic molecule
Emp. Form.:
C27H27N3O6S
Mol. Mass.:
521.585
SMILES:
CCCCc1nc(=O)c(c(O)n1-c1c(OC)cccc1OC)S(=O)(=O)c1ccc(cc1)-c1cccnc1
: