Target
Apelin receptor
Ligand
BDBM50567169
Substrate
Meas. Tech.
ChEMBL_2102447 (CHEMBL4810843)
EC50
0.027000±n/a nM
Citation
 Tora, GJiang, JBostwick, JSGargalovic, PSOnorato, JMLuk, CEGeneraux, CXu, CGalella, MAWang, THe, YWexler, RRFinlay, HJ Identification of 6-hydroxy-5-phenyl sulfonylpyrimidin-4(1H)-one APJ receptor agonists. Bioorg Med Chem Lett 50:0 (2021)  
Target
Name:
Apelin receptor
Synonyms:
APJ_MOUSE Angiotensin receptor-like 1 Aplnr MSR
Type:
PROTEIN
Mol. Mass.:
42269.53
Organism:
Mus musculus
Description:
ChEMBL_120488
Residue:
377
  
Inhibitor
Name:
BDBM50567169
Synonyms:
CHEMBL4873876
Type:
Small organic molecule
Emp. Form.:
C24H23ClN4O6
Mol. Mass.:
498.916
SMILES:
CCOCc1[nH]c(=O)c(-c2nnc(Cc3ccc(Cl)cn3)o2)c(O)c1-c1c(OC)cccc1OC
: