Target
Ectonucleotide pyrophosphatase/phosphodiesterase family member 2
Ligand
BDBM50540872
Substrate
Meas. Tech.
ChEMBL_2102522 (CHEMBL4810918)
IC50
1.0±n/a nM
Citation
 Chen, YLei, HLi, TCui, YWang, XCao, ZWu, HZhai, X Design, synthesis and anti-fibrosis evaluation of imidazo[1,2-a]pyridine derivatives as potent ATX inhibitors. Bioorg Med Chem 46:0 (2021)  
Target
Name:
Ectonucleotide pyrophosphatase/phosphodiesterase family member 2
Synonyms:
ATX Autotaxin (ATX) ENPP2 Ectonucleotide Pyrophosphatase/Phosphodiesterase 2 (ENPP2) Extracellular lysophospholipase D PDNP2
Type:
Enzyme
Mol. Mass.:
99007.13
Organism:
Homo sapiens (Human)
Description:
Q13822
Residue:
863
  
Inhibitor
Name:
BDBM50540872
Synonyms:
CHEMBL4647222
Type:
Small organic molecule
Emp. Form.:
C27H28F2N4O3S
Mol. Mass.:
526.598
SMILES:
CCn1cc(NC(=O)OCc2ccc(F)c(F)c2)c2cc(ccc12)-c1nc(CN2CCC(O)CC2)cs1
: