Target
Thioredoxin glutathione reductase
Ligand
BDBM54510
Substrate
Meas. Tech.
ChEMBL_2103008 (CHEMBL4811511)
IC50
210±n/a nM
Citation
 Dziwornu, GAAttram, HDGachuhi, SChibale, K Chemotherapy for human schistosomiasis: how far have we come? What's new? Where do we go from here? RSC Med Chem 11:455-490 (2020)  
Target
Name:
Thioredoxin glutathione reductase
Synonyms:
Type:
PROTEIN
Mol. Mass.:
64881.48
Organism:
Schistosoma mansoni
Description:
ChEMBL_1455608
Residue:
597
  
Inhibitor
Name:
BDBM54510
Synonyms:
5-chloranyl-N-[4-[ethyl(phenyl)sulfamoyl]phenyl]-2-methylsulfonyl-pyrimidine-4-carboxamide 5-chloro-N-[4-[ethyl(phenyl)sulfamoyl]phenyl]-2-methylsulfonyl-4-pyrimidinecarboxamide MLS001116357 cid_16012863
Type:
Small organic molecule
Emp. Form.:
C20H19ClN4O5S2
Mol. Mass.:
494.972
SMILES:
CCN(c1ccccc1)S(=O)(=O)c1ccc(NC(=O)c2nc(ncc2Cl)S(C)(=O)=O)cc1
: