Target
Nicotinic acetylcholine receptor alpha9/alpha10
Ligand
BDBM50567433
Substrate
Meas. Tech.
ChEMBL_2103229 (CHEMBL4811732)
IC50
>10000±n/a nM
Citation
 Hone, AJKaas, QKearns, IHararah, FGajewiak, JChristensen, SCraik, DJMcIntosh, JM Computational and Functional Mapping of Human and Rat ?6?4 Nicotinic Acetylcholine Receptors Reveals Species-Specific Ligand-Binding Motifs. J Med Chem 64:1685-1700 (2021)  
Target
Name:
Nicotinic acetylcholine receptor alpha9/alpha10
Synonyms:
Neuronal acetylcholine receptor subunit alpha-10/alpha-9
Type:
Mol. Mass.:
Description:
ASSAY_ID of ChEMBL is 2193071
Components:
This complex has 2 components.
Component 1
Name:
Neuronal acetylcholine receptor subunit alpha-9
Synonyms:
ACHA9_RAT Cholinergic, Nicotinic Muscle NACHR alpha 9 Nicotinic acetylcholine receptor subunit alpha 9
Type:
Enzyme Catalytic Domain
Mol. Mass.:
54522.69
Organism:
RAT
Description:
Cholinergic, Nicotinic Muscle 0 RAT::P43144
Residue:
479
  
Component 2
Name:
Neuronal acetylcholine receptor subunit alpha-10
Synonyms:
ACH10_RAT Neuronal acetylcholine receptor protein alpha-10 subunit | Nicotinic acetylcholine receptor alpha9/alpha10
Type:
PROTEIN
Mol. Mass.:
49830.54
Organism:
Rattus norvegicus
Description:
ChEMBL_143222
Residue:
447
  
Inhibitor
Name:
BDBM50567433
Synonyms:
CHEMBL4869892
Type:
Small organic molecule
Emp. Form.:
C68H103N23O21S4
Mol. Mass.:
1706.947
SMILES:
[H][C@]1(NC(=O)[C@H](CCC(O)=O)NC(=O)[C@@H]2CCCN2C(=O)[C@H](Cc2cnc[nH]2)NC(=O)[C@H](CC(N)=O)NC(=O)[C@@H](NC(=O)[C@H](CC(N)=O)NC(=O)[C@@H]2CSSC[C@H](NC(=O)CN)C(=O)N[C@@H](CSSC[C@H](NC1=O)C(N)=O)C(=O)N[C@@H](CO)C(=O)N[C@@H](Cc1cnc[nH]1)C(=O)N1CCC[C@H]1C(=O)N[C@@H](C(C)C)C(=O)N2)C(C)C)[C@@H](C)CC
: