Target
5-hydroxytryptamine receptor 5A
Ligand
BDBM50130262
Substrate
Meas. Tech.
ChEMBL_3584 (CHEMBL620717)
Ki
3200±n/a nM
Citation
 Khorana, NSmith, CHerrick-Davis, KPurohit, ATeitler, MGrella, BDukat, MGlennon, RA Binding of tetrahydrocarboline derivatives at human 5-HT5A receptors. J Med Chem 46:3930-7 (2003)  
Target
Name:
5-hydroxytryptamine receptor 5A
Synonyms:
5-HT-5 5-hydroxytryptamine receptor 5 (5-HT5) 5HT5A_HUMAN Serotonin (5-HT) receptor | Serotonin receptor 5A
Type:
Enzyme
Mol. Mass.:
40266.25
Organism:
Homo sapiens (Human)
Description:
P47898
Residue:
357
  
Inhibitor
Name:
BDBM50130262
Synonyms:
2,3,4,9-Tetrahydro-1H-beta-carboline EN300-119677
Type:
Small organic molecule
Emp. Form.:
C11H12N2
Mol. Mass.:
172.2264
SMILES:
C1Cc2c(CN1)[nH]c1ccccc21
: