Target
Protein kinase C beta type
Ligand
BDBM50132246
Substrate
Meas. Tech.
ChEMBL_160637 (CHEMBL768247)
Ki
539±n/a nM
Citation
 Nakagawa, YIrie, KYamanaka, NOhigashi, HTsuda, K Synthesis and binding selectivity of 7- and 15-decylbenzolactone-V8 for the C1 domains of protein kinase C isozymes. Bioorg Med Chem Lett 13:3015-9 (2003)  
Target
Name:
Protein kinase C beta type
Synonyms:
KPCB_HUMAN PKC beta PKCB PRKCB1 Protein kinase C beta type | Protein kinase C beta type II (PRKCB2)
Type:
Enzyme
Mol. Mass.:
76873.67
Organism:
Homo sapiens (Human)
Description:
The recombinant human PKC enzymes were produced using a baculovirus expression system in SF9 cells
Residue:
671
  
Inhibitor
Name:
BDBM50132246
Synonyms:
7-Decyl-5-hydroxymethyl-2-isopropyl-1-methyl-1,2,5,6-tetrahydro-benzo[e][1,4]oxazocin-3-one | CHEMBL103091
Type:
Small organic molecule
Emp. Form.:
C25H41NO3
Mol. Mass.:
403.5979
SMILES:
CCCCCCCCCCc1cccc2N(C)[C@@H](C(C)C)C(=O)O[C@H](CO)Cc12
: