Target
Protein kinase C alpha type
Ligand
BDBM50132248
Substrate
Meas. Tech.
ChEBML_160446
Ki
4050±n/a nM
Citation
 Nakagawa, YIrie, KYamanaka, NOhigashi, HTsuda, K Synthesis and binding selectivity of 7- and 15-decylbenzolactone-V8 for the C1 domains of protein kinase C isozymes. Bioorg Med Chem Lett 13:3015-9 (2003)  
Target
Name:
Protein kinase C alpha type
Synonyms:
KPCA_HUMAN PKC alpha and beta-2 PKC-alpha PRKACA Protein Kinase C- alpha Protein kinase C alpha (PKCa) Protein kinase C alpha type (PRKCA) RAF proto-oncogene serine/threonine-protein kinase
Type:
Enzyme
Mol. Mass.:
76755.65
Organism:
Homo sapiens (Human)
Description:
The recombinant human PKC enzymes were produced using a baculovirus expression system in SF9 cells
Residue:
672
  
Inhibitor
Name:
BDBM50132248
Synonyms:
9-Decyl-5-hydroxymethyl-2-isopropyl-1-methyl-1,2,5,6-tetrahydro-benzo[e][1,4]oxazocin-3-one | CHEMBL102858
Type:
Small organic molecule
Emp. Form.:
C25H41NO3
Mol. Mass.:
403.5979
SMILES:
CCCCCCCCCCc1ccc2C[C@@H](CO)OC(=O)[C@H](C(C)C)N(C)c2c1
: