Target
Protein kinase C delta type
Ligand
BDBM50097751
Substrate
Meas. Tech.
ChEMBL_160947 (CHEMBL769109)
Ki
1160±n/a nM
Citation
 Nakagawa, YIrie, KYamanaka, NOhigashi, HTsuda, K Synthesis and binding selectivity of 7- and 15-decylbenzolactone-V8 for the C1 domains of protein kinase C isozymes. Bioorg Med Chem Lett 13:3015-9 (2003)  
Target
Name:
Protein kinase C delta type
Synonyms:
KPCD_HUMAN PKCD Protein Kinase C- delta nPKC-delta
Type:
Enzyme
Mol. Mass.:
77516.79
Organism:
Homo sapiens (Human)
Description:
The recombinant human PKC enzymes were produced using a baculovirus expression system in SF9 cells
Residue:
676
  
Inhibitor
Name:
BDBM50097751
Synonyms:
(2S,5S)-8-Decyl-5-hydroxymethyl-2-isopropyl-1-methyl-1,2,5,6-tetrahydro-benzo[e][1,4]oxazocin-3-one CHEMBL318971
Type:
Small organic molecule
Emp. Form.:
C25H41NO3
Mol. Mass.:
403.5979
SMILES:
CCCCCCCCCCc1ccc2N(C)[C@@H](C(C)C)C(=O)O[C@H](CO)Cc2c1
: