Target
Mitogen-activated protein kinase 14
Ligand
BDBM50132412
Substrate
Meas. Tech.
ChEBML_124493
Kd
16±n/a nM
Citation
 Regan, JPargellis, CACirillo, PFGilmore, THickey, ERPeet, GWProto, ASwinamer, AMoss, N The kinetics of binding to p38MAP kinase by analogues of BIRB 796. Bioorg Med Chem Lett 13:3101-4 (2003)  
Target
Name:
Mitogen-activated protein kinase 14
Synonyms:
CSAID-binding protein CSBP1 CSPB1 MAP kinase 14 MAP kinase p38 alpha MAPK14 MK14_HUMAN Mitogen-activated protein kinase p38 alpha Stress-activated protein kinase 2a | p38 MAP kinase alpha/beta
Type:
Serine/threonine-protein kinase
Mol. Mass.:
41286.76
Organism:
Homo sapiens (Human)
Description:
Q16539
Residue:
360
  
Inhibitor
Name:
BDBM50132412
Synonyms:
1-[5-tert-Butyl-2-(3-dimethylaminomethyl-phenyl)-2H-pyrazol-3-yl]-3-[4-(2-morpholin-4-yl-ethoxy)-naphthalen-1-yl]-urea | CHEMBL318806
Type:
Small organic molecule
Emp. Form.:
C33H42N6O3
Mol. Mass.:
570.725
SMILES:
CN(C)Cc1cccc(c1)-n1nc(cc1NC(=O)Nc1ccc(OCCN2CCOCC2)c2ccccc12)C(C)(C)C
: