Target
Tryptophan 2,3-dioxygenase
Ligand
BDBM61215
Substrate
Meas. Tech.
ChEMBL_2104317 (CHEMBL4812820)
IC50
37870±n/a nM
Citation
 Capochiani de Iudicibus, RTomek, PPalmer, BDTijono, SMFlanagan, JUChing, LM Parallel discovery of selective and dual inhibitors of tryptophan dioxygenases IDO1 and TDO2 with a newly-modified enzymatic assay. Bioorg Med Chem 39:0 (2021)  
Target
Name:
Tryptophan 2,3-dioxygenase
Synonyms:
T23O_HUMAN TDO2 TRPO Tryptophan oxygenase Tryptophanase
Type:
PROTEIN
Mol. Mass.:
47874.48
Organism:
Homo sapiens (Human)
Description:
ChEMBL_825691
Residue:
406
  
Inhibitor
Name:
BDBM61215
Synonyms:
(5-amino-1-naphthalenyl)arsonic acid (5-aminonaphthalen-1-yl)arsonic acid MLS000737441 cid_224922
Type:
Small organic molecule
Emp. Form.:
C10H10AsNO3
Mol. Mass.:
267.1129
SMILES:
Nc1cccc2c(cccc12)[As](O)(O)=O
: