Target
Serine protease 1
Ligand
BDBM50132529
Substrate
Meas. Tech.
ChEMBL_212320 (CHEMBL815006)
Ki
557000±n/a nM
Citation
 Peterlin-Masic, LKranjc, AMarinko, PMlinsek, GSolmajer, TStegnar, MKikelj, D Selective 3-amino-2-pyridinone acetamide thrombin inhibitors incorporating weakly basic partially saturated heterobicyclic P1-arginine mimetics. Bioorg Med Chem Lett 13:3171-6 (2003)  
Target
Name:
Serine protease 1
Synonyms:
Beta-Trypsin PRSS1 TRY1 TRYP1 Trypsin I
Type:
Enzyme
Mol. Mass.:
25790.52
Organism:
Bos taurus (bovine)
Description:
P00760
Residue:
246
  
Inhibitor
Name:
BDBM50132529
Synonyms:
2-(6-Methyl-2-oxo-3-phenylmethanesulfonylamino-2H-pyridin-1-yl)-N-(2-methyl-4,5,6,7-tetrahydro-2H-indazol-5-ylmethyl)-acetamide | CHEMBL316820
Type:
Small organic molecule
Emp. Form.:
C24H29N5O4S
Mol. Mass.:
483.583
SMILES:
Cc1ccc(NS(=O)(=O)Cc2ccccc2)c(=O)n1CC(=O)NCC1CCc2nn(C)cc2C1
: