Target
Prothrombin
Ligand
BDBM50132522
Substrate
Meas. Tech.
ChEBML_208504
Ki
301±n/a nM
Citation
 Peterlin-Masic, LKranjc, AMarinko, PMlinsek, GSolmajer, TStegnar, MKikelj, D Selective 3-amino-2-pyridinone acetamide thrombin inhibitors incorporating weakly basic partially saturated heterobicyclic P1-arginine mimetics. Bioorg Med Chem Lett 13:3171-6 (2003)  
Target
Name:
Prothrombin
Synonyms:
Activation peptide fragment 1 Coagulation factor II Prothrombin precursor Thrombin heavy chain | Thrombin light chain
Type:
Protein
Mol. Mass.:
70029.57
Organism:
Homo sapiens (Human)
Description:
P00734
Residue:
622
  
Inhibitor
Name:
BDBM50132522
Synonyms:
CHEMBL100181 | N-(1H-Indazol-5-ylmethyl)-2-(6-methyl-2-oxo-3-phenylmethanesulfonylamino-2H-pyridin-1-yl)-acetamide
Type:
Small organic molecule
Emp. Form.:
C23H23N5O4S
Mol. Mass.:
465.525
SMILES:
Cc1ccc(NS(=O)(=O)Cc2ccccc2)c(=O)n1CC(=O)NCc1ccc2[nH]ncc2c1
: