Target
Prothrombin
Ligand
BDBM50132523
Substrate
Meas. Tech.
ChEBML_208504
Ki
2500±n/a nM
Citation
 Peterlin-Masic, LKranjc, AMarinko, PMlinsek, GSolmajer, TStegnar, MKikelj, D Selective 3-amino-2-pyridinone acetamide thrombin inhibitors incorporating weakly basic partially saturated heterobicyclic P1-arginine mimetics. Bioorg Med Chem Lett 13:3171-6 (2003)  
Target
Name:
Prothrombin
Synonyms:
Activation peptide fragment 1 Coagulation factor II Prothrombin precursor Thrombin heavy chain | Thrombin light chain
Type:
Protein
Mol. Mass.:
70029.57
Organism:
Homo sapiens (Human)
Description:
P00734
Residue:
622
  
Inhibitor
Name:
BDBM50132523
Synonyms:
CHEMBL110565 | N-(2-Amino-4,5,6,7-tetrahydro-benzothiazol-6-ylmethyl)-2-(6-methyl-2-oxo-3-phenylmethanesulfonylamino-2H-pyridin-1-yl)-acetamide
Type:
Small organic molecule
Emp. Form.:
C23H27N5O4S2
Mol. Mass.:
501.622
SMILES:
Cc1ccc(NS(=O)(=O)Cc2ccccc2)c(=O)n1CC(=O)NCC1CCc2nc(N)sc2C1
: