Target
Coagulation factor X
Ligand
BDBM50132526
Substrate
Meas. Tech.
ChEBML_49124
Ki
92000±n/a nM
Citation
 Peterlin-Masic, LKranjc, AMarinko, PMlinsek, GSolmajer, TStegnar, MKikelj, D Selective 3-amino-2-pyridinone acetamide thrombin inhibitors incorporating weakly basic partially saturated heterobicyclic P1-arginine mimetics. Bioorg Med Chem Lett 13:3171-6 (2003)  
Target
Name:
Coagulation factor X
Synonyms:
Activated coagulation factor X (FXa) Coagulation factor X precursor F10 Factor X heavy chain Factor Xa Stuart-Prower factor
Type:
Enzyme
Mol. Mass.:
54726.60
Organism:
Homo sapiens (Human)
Description:
Residue:
488
  
Inhibitor
Name:
BDBM50132526
Synonyms:
CHEMBL320542 | N-(2-Amino-4,5,6,7-tetrahydro-benzothiazol-6-yl)-2-(6-methyl-2-oxo-3-phenylmethanesulfonylamino-2H-pyridin-1-yl)-acetamide
Type:
Small organic molecule
Emp. Form.:
C22H25N5O4S2
Mol. Mass.:
487.595
SMILES:
Cc1ccc(NS(=O)(=O)Cc2ccccc2)c(=O)n1CC(=O)NC1CCc2sc(N)nc2C1
: