Target
Polyphenol oxidase 2
Ligand
BDBM50568152
Substrate
Meas. Tech.
ChEMBL_2104739 (CHEMBL4813242)
IC50
145±n/a nM
Citation
 Vanjare, BDChoi, NGMahajan, PGRaza, HHassan, MHan, YYu, SMKim, SJSeo, SYLee, KH Novel 1,3,4-oxadiazole compounds inhibit the tyrosinase and melanin level: Synthesis, in-vitro, and in-silico studies. Bioorg Med Chem 41:0 (2021)  
Target
Name:
Polyphenol oxidase 2
Synonyms:
Monophenol monooxygenase PPO2 Tyrosinase
Type:
Protein
Mol. Mass.:
63923.66
Organism:
Agaricus bisporus (Common mushroom)
Description:
O42713
Residue:
556
  
Inhibitor
Name:
BDBM50568152
Synonyms:
CHEMBL4869604
Type:
Small organic molecule
Emp. Form.:
C17H14BrN3O3S
Mol. Mass.:
420.28
SMILES:
COc1cccc(c1)-c1nnc(SCC(=O)Nc2ccc(Br)cc2)o1
: