Target
Dihydroorotate dehydrogenase (quinone), mitochondrial
Ligand
BDBM50568237
Substrate
Meas. Tech.
ChEMBL_2104887 (CHEMBL4813390)
IC50
700±n/a nM
Citation
 Petrovi?, MMRoschger, CChaudary, SZierer, AMladenovi?, MMarkovi?, VTrifunovi?, SJoksovi?, MD Low cytotoxic quinoline-4-carboxylic acids derived from vanillin precursors as potential human dihydroorotate dehydrogenase inhibitors. Bioorg Med Chem Lett 46:0 (2021)  
Target
Name:
Dihydroorotate dehydrogenase (quinone), mitochondrial
Synonyms:
DHODH Dihydroorotate dehydrogenase Dihydroorotate dehydrogenase, mitochondrial Dihydroorotate oxidase (DHODH) | PYRD_HUMAN
Type:
Enzyme
Mol. Mass.:
42881.33
Organism:
Homo sapiens (Human)
Description:
Q02127
Residue:
395
  
Inhibitor
Name:
BDBM50568237
Synonyms:
CHEMBL4862274
Type:
Small organic molecule
Emp. Form.:
C25H21N3O5
Mol. Mass.:
443.4513
SMILES:
COc1cc(ccc1OCC(=O)NCc1cccnc1)-c1cc(C(O)=O)c2ccccc2n1
: