Target
Plasminogen activator inhibitor 1
Ligand
BDBM50132856
Substrate
Meas. Tech.
ChEMBL_155612 (CHEMBL766347)
IC50
100±n/a nM
Citation
 Ye, BBauer, SBuckman, BOGhannam, AGriedel, BDKhim, SKLee, WSacchi, KLShaw, KJLiang, AWu, QZhao, Z Synthesis and biological evaluation of menthol-based derivatives as inhibitors of plasminogen activator inhibitor-1 (PAI-1). Bioorg Med Chem Lett 13:3361-5 (2003)  
Target
Name:
Plasminogen activator inhibitor 1
Synonyms:
Endothelial plasminogen activator inhibitor PAI-1 PAI1_HUMAN Plasminogen activator inhibitor 1 Plasminogen activator inhibitor-1 SERPINE1
Type:
Enzyme
Mol. Mass.:
45064.00
Organism:
Homo sapiens (Human)
Description:
P05121
Residue:
402
  
Inhibitor
Name:
BDBM50132856
Synonyms:
3-Hydroxy-4-[(4-{[2-((1R,2S,5R)-2-isopropyl-5-methyl-cyclohexyloxy)-acetylamino]-methyl}-phenylamino)-methyl]-8-methoxy-1,9-dimethyl-11-oxo-11H-dibenzo[b,e][1,4]dioxepine-6-carboxylic acid | CHEMBL325164
Type:
Small organic molecule
Emp. Form.:
C37H44N2O9
Mol. Mass.:
660.7533
SMILES:
COc1cc(C(O)=O)c2Oc3c(CNc4ccc(CNC(=O)CO[C@@H]5C[C@H](C)CC[C@H]5C(C)C)cc4)c(O)cc(C)c3C(=O)Oc2c1C
: