Target
Glycogen phosphorylase, muscle form
Ligand
BDBM50133447
Substrate
Meas. Tech.
ChEMBL_138359 (CHEMBL873438)
IC50
52±n/a nM
Citation
 Ogawa, AKWilloughby, CABergeron, REllsworth, KPGeissler, WMMyers, RWYao, JHarris, GChapman, KT Glucose-lowering in a db/db mouse model by dihydropyridine diacid glycogen phosphorylase inhibitors. Bioorg Med Chem Lett 13:3405-8 (2003)  
Target
Name:
Glycogen phosphorylase, muscle form
Synonyms:
Glycogen phosphorylase, muscle form Myophosphorylase PYGM_HUMAN
Type:
PROTEIN
Mol. Mass.:
97097.45
Organism:
Homo sapiens (Human)
Description:
ChEMBL_1449751
Residue:
842
  
Inhibitor
Name:
BDBM50133447
Synonyms:
4-(2-Chloro-phenyl)-6-methyl-1-(2,2,2-trifluoro-ethyl)-1,4-dihydro-pyridine-2,3,5-tricarboxylic acid 5-isopropyl ester | CHEMBL114271
Type:
Small organic molecule
Emp. Form.:
C20H19ClF3NO6
Mol. Mass.:
461.816
SMILES:
CC(C)OC(=O)C1=C(C)N(CC(F)(F)F)C(C(O)=O)=C(C1c1ccccc1Cl)C(O)=O
: