Target
Glycogen phosphorylase, muscle form
Ligand
BDBM50133433
Substrate
Meas. Tech.
ChEMBL_138359 (CHEMBL873438)
IC50
19.9±n/a nM
Citation
 Ogawa, AKWilloughby, CABergeron, REllsworth, KPGeissler, WMMyers, RWYao, JHarris, GChapman, KT Glucose-lowering in a db/db mouse model by dihydropyridine diacid glycogen phosphorylase inhibitors. Bioorg Med Chem Lett 13:3405-8 (2003)  
Target
Name:
Glycogen phosphorylase, muscle form
Synonyms:
Glycogen phosphorylase, muscle form Myophosphorylase PYGM_HUMAN
Type:
PROTEIN
Mol. Mass.:
97097.45
Organism:
Homo sapiens (Human)
Description:
ChEMBL_1449751
Residue:
842
  
Inhibitor
Name:
BDBM50133433
Synonyms:
4-(2-Chloro-phenyl)-1-ethyl-5-ethylcarbamoyl-6-methyl-1,4-dihydro-pyridine-2,3-dicarboxylic acid | CHEMBL114846
Type:
Small organic molecule
Emp. Form.:
C19H21ClN2O5
Mol. Mass.:
392.833
SMILES:
CCNC(=O)C1=C(C)N(CC)C(C(O)=O)=C(C1c1ccccc1Cl)C(O)=O
: