Target
Integrin beta-3
Ligand
BDBM50004058
Substrate
Meas. Tech.
ChEMBL_2106375 (CHEMBL4815050)
IC50
136±n/a nM
Citation
 Zaman, KAUPark, JHDeVine, LHu, ZWu, XKim, HSCao, S Secondary Metabolites from the Leather Coral-Derived Fungal Strain  J Nat Prod 84:466-473 (2021)  
Target
Name:
Integrin beta-3
Synonyms:
GPIIIa Integrin beta-3 Platelet membrane glycoprotein IIIa
Type:
PROTEIN
Mol. Mass.:
86916.53
Organism:
Rattus norvegicus
Description:
ChEMBL_118300
Residue:
787
  
Inhibitor
Name:
BDBM50004058
Synonyms:
(2S)-2-(butylsulfonylamino)-3-[4-(4-piperidin-4-ylbutoxy)phenyl]propanoic acid N-(butylsulfonyl)-O-(4-piperidin-4-ylbutyl)-L-tyrosine | tirofiban
Type:
Small organic molecule
Emp. Form.:
C22H36N2O5S
Mol. Mass.:
440.597
SMILES:
CCCCS(=O)(=O)N[C@@H](Cc1ccc(OCCCCC2CCNCC2)cc1)C(O)=O
: