Target
Serine protease 1
Ligand
BDBM50133520
Substrate
Meas. Tech.
ChEBML_213204
Ki
1600±n/a nM
Citation
 Rittle, KEBarrow, JCCutrona, KJGlass, KLKrueger, JAKuo, LCLewis, SDLucas, BJMcMasters, DRMorrissette, MMNantermet, PGNewton, CLSanders, WMYan, YVacca, JPSelnick, HG Unexpected enhancement of thrombin inhibitor potency with o-aminoalkylbenzylamides in the P1 position. Bioorg Med Chem Lett 13:3477-82 (2003)  
Target
Name:
Serine protease 1
Synonyms:
Alpha-trypsin chain 1 Beta-trypsin PRSS1 TRP1 TRY1_HUMAN Thrombin & trypsin Trypsin I | Trypsin-1
Type:
Enzyme
Mol. Mass.:
26557.80
Organism:
Homo sapiens (Human)
Description:
P07477
Residue:
247
  
Inhibitor
Name:
BDBM50133520
Synonyms:
CHEMBL116258 | N-(2-Aminomethyl-5-chloro-benzyl)-2-(6-methyl-2-oxo-3-phenethylamino-2H-pyrazin-1-yl)-acetamide
Type:
Small organic molecule
Emp. Form.:
C23H26ClN5O2
Mol. Mass.:
439.938
SMILES:
Cc1cnc(NCCc2ccccc2)c(=O)n1CC(=O)NCc1cc(Cl)ccc1CN
: