Target
Muscarinic acetylcholine receptor M2
Ligand
BDBM50568832
Substrate
Meas. Tech.
ChEMBL_2106935 (CHEMBL4815610)
Ki
0.100000±n/a nM
Citation
 Weinhart, CGWifling, DSchmidt, MFNeu, EHöring, CClark, TGmeiner, PKeller, M Dibenzodiazepinone-type muscarinic receptor antagonists conjugated to basic peptides: Impact of the linker moiety and unnatural amino acids on M Eur J Med Chem 213:0 (2021)  
Target
Name:
Muscarinic acetylcholine receptor M2
Synonyms:
ACM2_HUMAN Cholinergic, muscarinic M2 Muscarinic acetylcholine receptor M2 and M5 | RecName: Full=Muscarinic acetylcholine receptor M2
Type:
GPCR
Mol. Mass.:
51730.61
Organism:
Homo sapiens (Human)
Description:
P08172
Residue:
466
  
Inhibitor
Name:
BDBM50568832
Synonyms:
CHEMBL4597498
Type:
Small organic molecule
Emp. Form.:
C47H73N13O6
Mol. Mass.:
916.166
SMILES:
C[C@H](NC(=O)[C@H](CCCCN)NC(C)=O)C(=O)N[C@@H](CCCNC(N)=N)C(=O)NCCN1CCN(CCCCC2CCN(CC(=O)N3c4ccccc4NC(=O)c4ccccc34)CC2)CC1
: