Target
Activin receptor type-1
Ligand
BDBM4077
Substrate
Meas. Tech.
ChEMBL_2107053 (CHEMBL4815728)
IC50
4.0±n/a nM
Citation
 Nikhar, SSiokas, ISchlicher, LLee, SGyrd-Hansen, MDegterev, ACuny, GD Design of pyrido[2,3-d]pyrimidin-7-one inhibitors of receptor interacting protein kinase-2 (RIPK2) and nucleotide-binding oligomerization domain (NOD) cell signaling. Eur J Med Chem 215:0 (2021)  
Target
Name:
Activin receptor type-1
Synonyms:
2.7.11.30 ACVR1 ACVRLK2 ALK2/ACVR1 Activin receptor-like kinase 2 Activin receptor-like kinase 2 (ALK2/ACVR1) SKR1 TGF-B superfamily receptor type I | TSR-I
Type:
Mol. Mass.:
57158.32
Organism:
Homo sapiens (Human)
Description:
Residue:
509
  
Inhibitor
Name:
BDBM4077
Synonyms:
2-({4-[2-(diethylamino)ethoxy]phenyl}amino)-8-ethyl-6-phenyl-7H,8H-pyrido[2,3-d]pyrimidin-7-one pyrido[2,3-d]pyrimidin-7-one deriv. 54
Type:
Small organic molecule
Emp. Form.:
C27H31N5O2
Mol. Mass.:
457.5673
SMILES:
CCN(CC)CCOc1ccc(Nc2ncc3cc(-c4ccccc4)c(=O)n(CC)c3n2)cc1
: