Target
Inosine-5'-monophosphate dehydrogenase 2
Ligand
BDBM50133710
Substrate
Meas. Tech.
ChEBML_89932
IC50
84.0±n/a nM
Citation
 Dhar, TGShen, ZGu, HHChen, PNorris, DWatterson, SHBallentine, SKFleener, CARouleau, KABarrish, JCTownsend, RHollenbaugh, DLIwanowicz, EJ 3-cyanoindole-based inhibitors of inosine monophosphate dehydrogenase: synthesis and initial structure-activity relationships. Bioorg Med Chem Lett 13:3557-60 (2003)  
Target
Name:
Inosine-5'-monophosphate dehydrogenase 2
Synonyms:
IMDH2_HUMAN IMPD 2 IMPDH-II Inosine 5'-monophosphate dehydrogenase II (IMPDH II) Inosine-5 -monophosphate dehydrogenase 2 | Inosine-5'-monophosphate dehydrogenase (IMPDH)
Type:
Enzyme
Mol. Mass.:
55806.87
Organism:
Homo sapiens (Human)
Description:
Recombinant IMPDH2 expressed in E. coli.
Residue:
514
  
Inhibitor
Name:
BDBM50133710
Synonyms:
CHEMBL118714 | Naphthalene-1-carboxylic acid 3-[2-(3-cyano-1-methyl-1H-indol-6-ylamino)-oxazol-5-yl]-benzylamide
Type:
Small organic molecule
Emp. Form.:
C31H23N5O2
Mol. Mass.:
497.5466
SMILES:
Cn1cc(C#N)c2ccc(Nc3ncc(o3)-c3cccc(CNC(=O)c4cccc5ccccc45)c3)cc12
: