Target
Inosine-5'-monophosphate dehydrogenase 2
Ligand
BDBM50120533
Substrate
Meas. Tech.
ChEBML_89932
IC50
93±n/a nM
Citation
 Dhar, TGShen, ZGu, HHChen, PNorris, DWatterson, SHBallentine, SKFleener, CARouleau, KABarrish, JCTownsend, RHollenbaugh, DLIwanowicz, EJ 3-cyanoindole-based inhibitors of inosine monophosphate dehydrogenase: synthesis and initial structure-activity relationships. Bioorg Med Chem Lett 13:3557-60 (2003)  
Target
Name:
Inosine-5'-monophosphate dehydrogenase 2
Synonyms:
IMDH2_HUMAN IMPD 2 IMPDH-II Inosine 5'-monophosphate dehydrogenase II (IMPDH II) Inosine-5 -monophosphate dehydrogenase 2 | Inosine-5'-monophosphate dehydrogenase (IMPDH)
Type:
Enzyme
Mol. Mass.:
55806.87
Organism:
Homo sapiens (Human)
Description:
Recombinant IMPDH2 expressed in E. coli.
Residue:
514
  
Inhibitor
Name:
BDBM50120533
Synonyms:
(3-Oxazol-5-yl-1H-indol-6-yl)-(5-phenyl-oxazol-2-yl)-amine | CHEMBL109335
Type:
Small organic molecule
Emp. Form.:
C20H14N4O2
Mol. Mass.:
342.3508
SMILES:
N(c1ncc(o1)-c1ccccc1)c1ccc2c(c[nH]c2c1)-c1cnco1
: