Target
Inosine-5'-monophosphate dehydrogenase 2
Ligand
BDBM50133728
Substrate
Meas. Tech.
ChEBML_89932
IC50
33±n/a nM
Citation
 Dhar, TGShen, ZGu, HHChen, PNorris, DWatterson, SHBallentine, SKFleener, CARouleau, KABarrish, JCTownsend, RHollenbaugh, DLIwanowicz, EJ 3-cyanoindole-based inhibitors of inosine monophosphate dehydrogenase: synthesis and initial structure-activity relationships. Bioorg Med Chem Lett 13:3557-60 (2003)  
Target
Name:
Inosine-5'-monophosphate dehydrogenase 2
Synonyms:
IMDH2_HUMAN IMPD 2 IMPDH-II Inosine 5'-monophosphate dehydrogenase II (IMPDH II) Inosine-5 -monophosphate dehydrogenase 2 | Inosine-5'-monophosphate dehydrogenase (IMPDH)
Type:
Enzyme
Mol. Mass.:
55806.87
Organism:
Homo sapiens (Human)
Description:
Recombinant IMPDH2 expressed in E. coli.
Residue:
514
  
Inhibitor
Name:
BDBM50133728
Synonyms:
1-Methyl-6-(5-phenyl-oxazol-2-ylamino)-1H-indole-3-carbonitrile | CHEMBL331535
Type:
Small organic molecule
Emp. Form.:
C19H14N4O
Mol. Mass.:
314.3407
SMILES:
Cn1cc(C#N)c2ccc(Nc3ncc(o3)-c3ccccc3)cc12
: