Target
Inosine-5'-monophosphate dehydrogenase 2
Ligand
BDBM50133729
Substrate
Meas. Tech.
ChEBML_89932
IC50
290±n/a nM
Citation
 Dhar, TGShen, ZGu, HHChen, PNorris, DWatterson, SHBallentine, SKFleener, CARouleau, KABarrish, JCTownsend, RHollenbaugh, DLIwanowicz, EJ 3-cyanoindole-based inhibitors of inosine monophosphate dehydrogenase: synthesis and initial structure-activity relationships. Bioorg Med Chem Lett 13:3557-60 (2003)  
Target
Name:
Inosine-5'-monophosphate dehydrogenase 2
Synonyms:
IMDH2_HUMAN IMPD 2 IMPDH-II Inosine 5'-monophosphate dehydrogenase II (IMPDH II) Inosine-5 -monophosphate dehydrogenase 2 | Inosine-5'-monophosphate dehydrogenase (IMPDH)
Type:
Enzyme
Mol. Mass.:
55806.87
Organism:
Homo sapiens (Human)
Description:
Recombinant IMPDH2 expressed in E. coli.
Residue:
514
  
Inhibitor
Name:
BDBM50133729
Synonyms:
1-(4-Cyano-3-methoxy-phenyl)-3-m-tolyl-urea | CHEMBL116208
Type:
Small organic molecule
Emp. Form.:
C16H15N3O2
Mol. Mass.:
281.3092
SMILES:
COc1cc(NC(=O)Nc2cccc(C)c2)ccc1C#N
: