Target
Inosine-5'-monophosphate dehydrogenase 2
Ligand
BDBM50133727
Substrate
Meas. Tech.
ChEBML_89932
IC50
630±n/a nM
Citation
 Dhar, TGShen, ZGu, HHChen, PNorris, DWatterson, SHBallentine, SKFleener, CARouleau, KABarrish, JCTownsend, RHollenbaugh, DLIwanowicz, EJ 3-cyanoindole-based inhibitors of inosine monophosphate dehydrogenase: synthesis and initial structure-activity relationships. Bioorg Med Chem Lett 13:3557-60 (2003)  
Target
Name:
Inosine-5'-monophosphate dehydrogenase 2
Synonyms:
IMDH2_HUMAN IMPD 2 IMPDH-II Inosine 5'-monophosphate dehydrogenase II (IMPDH II) Inosine-5 -monophosphate dehydrogenase 2 | Inosine-5'-monophosphate dehydrogenase (IMPDH)
Type:
Enzyme
Mol. Mass.:
55806.87
Organism:
Homo sapiens (Human)
Description:
Recombinant IMPDH2 expressed in E. coli.
Residue:
514
  
Inhibitor
Name:
BDBM50133727
Synonyms:
1-(3-Cyano-1-methyl-1H-indol-6-yl)-3-phenyl-urea CHEMBL333482
Type:
Small organic molecule
Emp. Form.:
C17H14N4O
Mol. Mass.:
290.3193
SMILES:
Cn1cc(C#N)c2ccc(NC(=O)Nc3ccccc3)cc12
: