Target
P2Y purinoceptor 14
Ligand
BDBM50569005
Substrate
Meas. Tech.
ChEMBL_2107299 (CHEMBL4815974)
IC50
2.2±n/a nM
Citation
 Lu, RWang, YLiu, CZhang, ZLi, BMeng, ZJiang, CHu, Q Design, synthesis and evaluation of 3-amide-5-aryl benzoic acid derivatives as novel P2Y Eur J Med Chem 216:0 (2021)  
Target
Name:
P2Y purinoceptor 14
Synonyms:
GPR105 KIAA0001 P2Y14_HUMAN | Purinergic receptor P2Y14
Type:
PROTEIN
Mol. Mass.:
38991.62
Organism:
Homo sapiens (Human)
Description:
ChEMBL_1502487
Residue:
338
  
Inhibitor
Name:
BDBM50569005
Synonyms:
CHEMBL4854775
Type:
Small organic molecule
Emp. Form.:
C19H15NO4
Mol. Mass.:
321.3267
SMILES:
Cc1ccc(cc1)C(=O)Nc1cc(cc(c1)-c1ccoc1)C(O)=O
: