Target
Carbonic anhydrase 9
Ligand
BDBM50569030
Substrate
Meas. Tech.
ChEMBL_2107360 (CHEMBL4816035)
Ki
8.4±n/a nM
Citation
 Shaldam, MEldehna, WMNocentini, AElsayed, ZMIbrahim, TMSalem, REl-Domany, RACapasso, CAbdel-Aziz, HASupuran, CT Development of novel benzofuran-based SLC-0111 analogs as selective cancer-associated carbonic anhydrase isoform IX inhibitors. Eur J Med Chem 216:0 (2021)  
Target
Name:
Carbonic anhydrase 9
Synonyms:
CA-IX CAH9_HUMAN Carbonic anhydrase 9 (CA IX) Carbonic anhydrase 9 precursor Carbonic anhydrase IX (CAIX) Carbonic anhydrases; II & IX MN RCC-associated antigen G250
Type:
Enzyme
Mol. Mass.:
49669.03
Organism:
Homo sapiens (Human)
Description:
Catalytic domain of human cloned isozyme was used in the assay
Residue:
459
  
Inhibitor
Name:
BDBM50569030
Synonyms:
CHEMBL4854110
Type:
Small organic molecule
Emp. Form.:
C17H17N3O4S
Mol. Mass.:
359.4
SMILES:
Cc1c(NC(=O)Nc2ccc(C)c(c2)S(N)(=O)=O)oc2ccccc12
: