Target
Carbonic anhydrase 9
Ligand
BDBM50569039
Substrate
Meas. Tech.
ChEMBL_2107360 (CHEMBL4816035)
Ki
20±n/a nM
Citation
 Shaldam, MEldehna, WMNocentini, AElsayed, ZMIbrahim, TMSalem, REl-Domany, RACapasso, CAbdel-Aziz, HASupuran, CT Development of novel benzofuran-based SLC-0111 analogs as selective cancer-associated carbonic anhydrase isoform IX inhibitors. Eur J Med Chem 216:0 (2021)  
Target
Name:
Carbonic anhydrase 9
Synonyms:
CA-IX CAH9_HUMAN Carbonic anhydrase 9 (CA IX) Carbonic anhydrase 9 precursor Carbonic anhydrase IX (CAIX) Carbonic anhydrases; II & IX MN RCC-associated antigen G250
Type:
Enzyme
Mol. Mass.:
49669.03
Organism:
Homo sapiens (Human)
Description:
Catalytic domain of human cloned isozyme was used in the assay
Residue:
459
  
Inhibitor
Name:
BDBM50569039
Synonyms:
CHEMBL4860334
Type:
Small organic molecule
Emp. Form.:
C15H12BrN3O4S
Mol. Mass.:
410.242
SMILES:
NS(=O)(=O)c1cccc(NC(=O)Nc2cc3cc(Br)ccc3o2)c1
: