Target
Carbonic anhydrase 12
Ligand
BDBM50569035
Substrate
Meas. Tech.
ChEMBL_2107361 (CHEMBL4816036)
Ki
15±n/a nM
Citation
 Shaldam, MEldehna, WMNocentini, AElsayed, ZMIbrahim, TMSalem, REl-Domany, RACapasso, CAbdel-Aziz, HASupuran, CT Development of novel benzofuran-based SLC-0111 analogs as selective cancer-associated carbonic anhydrase isoform IX inhibitors. Eur J Med Chem 216:0 (2021)  
Target
Name:
Carbonic anhydrase 12
Synonyms:
CA-XII CAH12_HUMAN Carbonic anhydrase Carbonic anhydrase XII Carbonic anhydrase XII (CAXII) | Tumor antigen HOM-RCC-3.1.3
Type:
Enzyme
Mol. Mass.:
39456.00
Organism:
Homo sapiens (Human)
Description:
Catalytic domain of human cloned isozyme was used in the assay
Residue:
354
  
Inhibitor
Name:
BDBM50569035
Synonyms:
CHEMBL4867387
Type:
Small organic molecule
Emp. Form.:
C18H19N3O4S
Mol. Mass.:
373.426
SMILES:
Cc1c(NC(=O)NCCc2ccc(cc2)S(N)(=O)=O)oc2ccccc12
: