Target
Carbonic anhydrase 9
Ligand
BDBM50569045
Substrate
Meas. Tech.
ChEMBL_2107374 (CHEMBL4816049)
Ki
10.0±n/a nM
Citation
 Shaldam, MEldehna, WMNocentini, AElsayed, ZMIbrahim, TMSalem, REl-Domany, RACapasso, CAbdel-Aziz, HASupuran, CT Development of novel benzofuran-based SLC-0111 analogs as selective cancer-associated carbonic anhydrase isoform IX inhibitors. Eur J Med Chem 216:0 (2021)  
Target
Name:
Carbonic anhydrase 9
Synonyms:
CA-IX CAH9_HUMAN Carbonic anhydrase 9 (CA IX) Carbonic anhydrase 9 precursor Carbonic anhydrase IX (CAIX) Carbonic anhydrases; II & IX MN RCC-associated antigen G250
Type:
Enzyme
Mol. Mass.:
49669.03
Organism:
Homo sapiens (Human)
Description:
Catalytic domain of human cloned isozyme was used in the assay
Residue:
459
  
Inhibitor
Name:
BDBM50569045
Synonyms:
CHEMBL4849803
Type:
Small organic molecule
Emp. Form.:
C23H20BrN3O5S2
Mol. Mass.:
562.456
SMILES:
Cc1ccc(cc1)S(=O)(=O)C\C(=N/Nc1ccc(cc1)S(N)(=O)=O)c1cc2cc(Br)ccc2o1
: