Target
Carbapenem-hydrolyzing beta-lactamase KPC
Ligand
BDBM50277665
Substrate
Meas. Tech.
ChEMBL_2108467 (CHEMBL4817142)
IC50
670±n/a nM
Citation
 Yan, YHLi, ZFNing, XLDeng, JYu, JLLuo, YWang, ZLi, GLi, GBXiao, YC Discovery of 3-aryl substituted benzoxaboroles as broad-spectrum inhibitors of serine- and metallo-?-lactamases. Bioorg Med Chem Lett 41:0 (2021)  
Target
Name:
Carbapenem-hydrolyzing beta-lactamase KPC
Synonyms:
BLKPC_KLEOX bla kpc2
Type:
Protein
Mol. Mass.:
31116.99
Organism:
Description:
Q848S6
Residue:
293
 
Inhibitor
Name:
BDBM50277665
Synonyms:
4-(1-hydroxy-1,3-dihydrobenzo[c][1,2]oxaborol-5-yloxy)benzonitrile AN-2728 Crisaborole | Eucrisa
Type:
Small organic molecule
Emp. Form.:
C14H10BNO3
Mol. Mass.:
251.045
SMILES:
OB1OCc2cc(Oc3ccc(cc3)C#N)ccc12
: