Target
Tubulin alpha-1A chain
Ligand
BDBM50070107
Substrate
Meas. Tech.
ChEBML_211866
IC50
500±n/a nM
Citation
 Lawrence, NJRennison, DMcGown, ATHadfield, JA The total synthesis of an aurone isolated from Uvaria hamiltonii: aurones and flavones as anticancer agents. Bioorg Med Chem Lett 13:3759-63 (2003)  
Target
Name:
Tubulin alpha-1A chain
Synonyms:
TBA1A_PIG Tubulin Tubulin alpha-1A chain
Type:
Protein
Mol. Mass.:
50049.25
Organism:
Sus scrofa (Pig)
Description:
P02550
Residue:
451
  
Inhibitor
Name:
BDBM50070107
Synonyms:
(E)-3-(3''-Hydroxy-4''-methoxyphenyl)-2-methyl-1-(3',4',5'-trimethoxyphenyl)prop-2-en-1-one (E)-3-(3-hydroxy-4-methoxyphenyl)-2-methyl-1-(3,4,5-trimethoxyphenyl)prop-2-en-1-one CHEMBL9859
Type:
Small organic molecule
Emp. Form.:
C20H22O6
Mol. Mass.:
358.3851
SMILES:
COc1ccc(\C=C(/C)C(=O)c2cc(OC)c(OC)c(OC)c2)cc1O
: