Target
Potassium voltage-gated channel subfamily H member 2
Ligand
BDBM50569446
Substrate
Meas. Tech.
ChEMBL_2109357 (CHEMBL4818032)
IC50
>10000±n/a nM
Citation
 Kim, MKim, GKang, MKo, DNam, YMoon, CSKang, HMShin, JSWerz, OLee, KTLee, JY Discovery of N-amido-phenylsulfonamide derivatives as novel microsomal prostaglandin E Bioorg Med Chem Lett 41:0 (2021)  
Target
Name:
Potassium voltage-gated channel subfamily H member 2
Synonyms:
1,3-beta-glucan synthase component GLS2 ERG Eag-related protein 1 Ether-a-go-go-related gene (HERG) Ether-a-go-go-related gene potassium channel 1 Ether-a-go-go-related gene potassium channel 1 (hERG1) Ether-a-go-go-related protein 1 H-ERG KCNH2 Potassium voltage-gated channel subfamily H member 2 (hERG) Voltage-gated potassium channel subunit Kv11.1 hERG Potassium Channel 1 | putative potassium channel subunit
Type:
Multi-pass membrane protein
Mol. Mass.:
126672.65
Organism:
Homo sapiens (Human)
Description:
Q12809
Residue:
1159
  
Inhibitor
Name:
BDBM50569446
Synonyms:
CHEMBL4870406
Type:
Small organic molecule
Emp. Form.:
C30H29ClN2O4S
Mol. Mass.:
549.08
SMILES:
Clc1ccc(cc1)S(=O)(=O)N(Cc1ccccc1)C(=O)Nc1ccc(OCCCCc2ccccc2)cc1
: