Target
Cannabinoid receptor 2
Ligand
BDBM50570252
Substrate
Meas. Tech.
ChEMBL_2111477 (CHEMBL4820327)
EC50
2.4±n/a nM
Citation
 Gado, FMohamed, KAMeini, SFerrisi, RBertini, SDigiacomo, MD'Andrea, FStevenson, LALaprairie, RBPertwee, RGManera, C Variously substituted 2-oxopyridine derivatives: Extending the structure-activity relationships for allosteric modulation of the cannabinoid CB2 receptor. Eur J Med Chem 211:0 (2021)  
Target
Name:
Cannabinoid receptor 2
Synonyms:
CANNABINOID CB2 CB2 CB2B CNR2_HUMAN Cannabinoid CB2 receptor Cannabinoid receptor 2 (CB2R) | hCB2
Type:
G Protein-Coupled Receptor (GPCR)
Mol. Mass.:
39690.94
Organism:
Homo sapiens (Human)
Description:
P34972
Residue:
360
  
Inhibitor
Name:
BDBM50570252
Synonyms:
CHEMBL4866198
Type:
Small organic molecule
Emp. Form.:
C21H24BrClN2O2
Mol. Mass.:
451.784
SMILES:
Cc1c(Br)cn(Cc2ccccc2Cl)c(=O)c1NC(=O)C1CCCCCC1
: