Target
Cannabinoid receptor 2
Ligand
BDBM50570253
Substrate
Meas. Tech.
ChEMBL_2111478 (CHEMBL4820328)
EC50
17±n/a nM
Citation
 Gado, FMohamed, KAMeini, SFerrisi, RBertini, SDigiacomo, MD'Andrea, FStevenson, LALaprairie, RBPertwee, RGManera, C Variously substituted 2-oxopyridine derivatives: Extending the structure-activity relationships for allosteric modulation of the cannabinoid CB2 receptor. Eur J Med Chem 211:0 (2021)  
Target
Name:
Cannabinoid receptor 2
Synonyms:
CANNABINOID CB2 CB2 CB2B CNR2_HUMAN Cannabinoid CB2 receptor Cannabinoid receptor 2 (CB2R) | hCB2
Type:
G Protein-Coupled Receptor (GPCR)
Mol. Mass.:
39690.94
Organism:
Homo sapiens (Human)
Description:
P34972
Residue:
360
  
Inhibitor
Name:
BDBM50570253
Synonyms:
CHEMBL4467500
Type:
Small organic molecule
Emp. Form.:
C21H24BrFN2O2
Mol. Mass.:
435.33
SMILES:
Cc1c(Br)cn(Cc2ccc(F)cc2)c(=O)c1NC(=O)C1CCCCCC1
: