Target
Cyclin-T1/Cyclin-dependent kinase 9
Ligand
BDBM50570310
Substrate
Meas. Tech.
ChEMBL_2111873 (CHEMBL4820723)
Ki
3.0±n/a nM
Citation
 Shao, HFoley, DWHuang, SAbbas, AYLam, FGershkovich, PBradshaw, TDPepper, CFischer, PMWang, S Structure-based design of highly selective 2,4,5-trisubstituted pyrimidine CDK9 inhibitors as anti-cancer agents. Eur J Med Chem 214:0 (2021)  
Target
Name:
Cyclin-T1/Cyclin-dependent kinase 9
Synonyms:
CDK9/ Cyclin-T1 CDK9/Cyclin T Cyclin T1/dependent kinase 9 | Cyclin-Dependent Kinase 9 (CDK9)
Type:
Protein Complex
Mol. Mass.:
Description:
Components:
This complex has 2 components.
Component 1
Name:
Cyclin-T1
Synonyms:
CCNT1 CycT Cyclin T Cyclin-T
Type:
Enzyme Subunit
Mol. Mass.:
80712.40
Organism:
Homo sapiens (Human)
Description:
Residue:
726
  
Component 2
Name:
Cyclin-dependent kinase 9
Synonyms:
C-2K CDK9 Cell division cycle 2-like protein kinase 4 Cyclin-Dependent Kinase 9 (CDK9) Serine/threonine-protein kinase PITALRE Tat-associated kinase complex catalytic subunit
Type:
Enzyme Subunit
Mol. Mass.:
42789.13
Organism:
Homo sapiens (Human)
Description:
Residue:
372
  
Inhibitor
Name:
BDBM50570310
Synonyms:
CHEMBL4876861
Type:
Small organic molecule
Emp. Form.:
C19H23N7S
Mol. Mass.:
381.498
SMILES:
CNc1ncc(s1)-c1ccnc(Nc2cccc(c2)N2CCCNCC2)n1
: