Target
Cathepsin S
Ligand
BDBM50135539
Substrate
Meas. Tech.
ChEBML_48682
IC50
2600±n/a nM
Citation
 Greenspan, PDClark, KLCowen, SDMcQuire, LWTommasi, RAFarley, DLQuadros, ECoppa, DEDu, ZFang, ZZhou, HDoughty, JToscano, KTWigg, AMZhou, S N-arylaminonitriles as bioavailable peptidomimetic inhibitors of cathepsin B. Bioorg Med Chem Lett 13:4121-4 (2003)  
Target
Name:
Cathepsin S
Synonyms:
CATS_HUMAN Cathepsin S (Cat S) | cathepsin S preproprotein
Type:
Protein
Mol. Mass.:
37507.38
Organism:
Homo sapiens (Human)
Description:
P25774
Residue:
331
  
Inhibitor
Name:
BDBM50135539
Synonyms:
3-[(R)-2-Cyano-2-((S)-3-phenyl-2-phenylamino-propionylamino)-ethoxymethyl]-benzoic acid | CHEMBL335269
Type:
Small organic molecule
Emp. Form.:
C26H25N3O4
Mol. Mass.:
443.4944
SMILES:
OC(=O)c1cccc(COC[C@H](NC(=O)[C@H](Cc2ccccc2)Nc2ccccc2)C#N)c1
: