Target
Procathepsin L
Ligand
BDBM50135540
Substrate
Meas. Tech.
ChEBML_48521
IC50
2800±n/a nM
Citation
 Greenspan, PDClark, KLCowen, SDMcQuire, LWTommasi, RAFarley, DLQuadros, ECoppa, DEDu, ZFang, ZZhou, HDoughty, JToscano, KTWigg, AMZhou, S N-arylaminonitriles as bioavailable peptidomimetic inhibitors of cathepsin B. Bioorg Med Chem Lett 13:4121-4 (2003)  
Target
Name:
Procathepsin L
Synonyms:
CATL1_HUMAN CTSL CTSL1 Cathepsin L Cathepsin L1 heavy chain MEP cathepsin L preproprotein
Type:
Enzyme
Mol. Mass.:
37557.19
Organism:
Homo sapiens (Human)
Description:
Purchased from Calbiochem (San Diego, CA).
Residue:
333
  
Inhibitor
Name:
BDBM50135540
Synonyms:
4-[(R)-2-Cyano-2-((S)-2-phenylamino-3-m-tolyl-propionylamino)-ethoxymethyl]-benzoic acid | CHEMBL133785
Type:
Small organic molecule
Emp. Form.:
C27H27N3O4
Mol. Mass.:
457.521
SMILES:
Cc1cccc(C[C@H](Nc2ccccc2)C(=O)N[C@@H](COCc2ccc(cc2)C(O)=O)C#N)c1
: