Target
Cathepsin S
Ligand
BDBM50135542
Substrate
Meas. Tech.
ChEBML_48682
IC50
1200±n/a nM
Citation
 Greenspan, PDClark, KLCowen, SDMcQuire, LWTommasi, RAFarley, DLQuadros, ECoppa, DEDu, ZFang, ZZhou, HDoughty, JToscano, KTWigg, AMZhou, S N-arylaminonitriles as bioavailable peptidomimetic inhibitors of cathepsin B. Bioorg Med Chem Lett 13:4121-4 (2003)  
Target
Name:
Cathepsin S
Synonyms:
CATS_HUMAN Cathepsin S (Cat S) | cathepsin S preproprotein
Type:
Protein
Mol. Mass.:
37507.38
Organism:
Homo sapiens (Human)
Description:
P25774
Residue:
331
  
Inhibitor
Name:
BDBM50135542
Synonyms:
(S)-N-((R)-Benzyloxymethyl-cyano-methyl)-2-phenylamino-3-m-tolyl-propionamide | CHEMBL133508
Type:
Small organic molecule
Emp. Form.:
C26H27N3O2
Mol. Mass.:
413.5115
SMILES:
Cc1cccc(C[C@H](Nc2ccccc2)C(=O)N[C@@H](COCc2ccccc2)C#N)c1
: