Target
Cathepsin S
Ligand
BDBM50135533
Substrate
Meas. Tech.
ChEBML_48682
IC50
1000±n/a nM
Citation
 Greenspan, PDClark, KLCowen, SDMcQuire, LWTommasi, RAFarley, DLQuadros, ECoppa, DEDu, ZFang, ZZhou, HDoughty, JToscano, KTWigg, AMZhou, S N-arylaminonitriles as bioavailable peptidomimetic inhibitors of cathepsin B. Bioorg Med Chem Lett 13:4121-4 (2003)  
Target
Name:
Cathepsin S
Synonyms:
CATS_HUMAN Cathepsin S (Cat S) | cathepsin S preproprotein
Type:
Protein
Mol. Mass.:
37507.38
Organism:
Homo sapiens (Human)
Description:
P25774
Residue:
331
  
Inhibitor
Name:
BDBM50135533
Synonyms:
(S)-N-[(R)-Cyano-(3-tetrazol-1-yl-benzyloxymethyl)-methyl]-2-(3-oxo-1,3-dihydro-isobenzofuran-5-ylamino)-3-m-tolyl-propionamide | CHEMBL335426
Type:
Small organic molecule
Emp. Form.:
C29H27N7O4
Mol. Mass.:
537.5692
SMILES:
Cc1cccc(C[C@H](Nc2ccc3COC(=O)c3c2)C(=O)N[C@@H](COCc2cccc(c2)-n2cnnn2)C#N)c1
: