Target
Procathepsin L
Ligand
BDBM50135543
Substrate
Meas. Tech.
ChEBML_48521
IC50
>1000±n/a nM
Citation
 Greenspan, PDClark, KLCowen, SDMcQuire, LWTommasi, RAFarley, DLQuadros, ECoppa, DEDu, ZFang, ZZhou, HDoughty, JToscano, KTWigg, AMZhou, S N-arylaminonitriles as bioavailable peptidomimetic inhibitors of cathepsin B. Bioorg Med Chem Lett 13:4121-4 (2003)  
Target
Name:
Procathepsin L
Synonyms:
CATL1_HUMAN CTSL CTSL1 Cathepsin L Cathepsin L1 heavy chain MEP cathepsin L preproprotein
Type:
Enzyme
Mol. Mass.:
37557.19
Organism:
Homo sapiens (Human)
Description:
Purchased from Calbiochem (San Diego, CA).
Residue:
333
  
Inhibitor
Name:
BDBM50135543
Synonyms:
3-{(R)-2-Cyano-2-[(S)-2-(2-methyl-1,3-dioxo-2,3-dihydro-1H-isoindol-5-ylamino)-3-m-tolyl-propionylamino]-ethoxymethyl}-benzoic acid | CHEMBL133728
Type:
Small organic molecule
Emp. Form.:
C30H28N4O6
Mol. Mass.:
540.5665
SMILES:
CN1C(=O)c2ccc(N[C@@H](Cc3cccc(C)c3)C(=O)N[C@@H](COCc3cccc(c3)C(O)=O)C#N)cc2C1=O
: