Target
Procathepsin L
Ligand
BDBM50135541
Substrate
Meas. Tech.
ChEBML_48521
IC50
1100±n/a nM
Citation
 Greenspan, PDClark, KLCowen, SDMcQuire, LWTommasi, RAFarley, DLQuadros, ECoppa, DEDu, ZFang, ZZhou, HDoughty, JToscano, KTWigg, AMZhou, S N-arylaminonitriles as bioavailable peptidomimetic inhibitors of cathepsin B. Bioorg Med Chem Lett 13:4121-4 (2003)  
Target
Name:
Procathepsin L
Synonyms:
CATL1_HUMAN CTSL CTSL1 Cathepsin L Cathepsin L1 heavy chain MEP cathepsin L preproprotein
Type:
Enzyme
Mol. Mass.:
37557.19
Organism:
Homo sapiens (Human)
Description:
Purchased from Calbiochem (San Diego, CA).
Residue:
333
  
Inhibitor
Name:
BDBM50135541
Synonyms:
5-{(R)-2-Cyano-2-[(S)-2-(3-oxo-1,3-dihydro-isobenzofuran-5-ylamino)-3-m-tolyl-propionylamino]-ethoxymethyl}-2-fluoro-benzoic acid | CHEMBL131688
Type:
Small organic molecule
Emp. Form.:
C29H26FN3O6
Mol. Mass.:
531.5316
SMILES:
Cc1cccc(C[C@H](Nc2ccc3COC(=O)c3c2)C(=O)N[C@@H](COCc2ccc(F)c(c2)C(O)=O)C#N)c1
: