Target
Glycogen phosphorylase, muscle form
Ligand
BDBM50135558
Substrate
Meas. Tech.
ChEBML_70984
IC50
9±n/a nM
Citation
 Lu, ZBohn, JBergeron, RDeng, QEllsworth, KPGeissler, WMHarris, GMcCann, PEMcKeever, BMyers, RWSaperstein, RWilloughby, CAYao, JChapman, K A new class of glycogen phosphorylase inhibitors. Bioorg Med Chem Lett 13:4125-8 (2003)  
Target
Name:
Glycogen phosphorylase, muscle form
Synonyms:
Glycogen phosphorylase, muscle form Myophosphorylase PYGM_HUMAN
Type:
PROTEIN
Mol. Mass.:
97097.45
Organism:
Homo sapiens (Human)
Description:
ChEMBL_1449751
Residue:
842
  
Inhibitor
Name:
BDBM50135558
Synonyms:
4-{3-Fluoro-2-[(4-nitro-pyridine-2-carbonyl)-amino]-phenoxy}-phthalic acid | CHEMBL133911
Type:
Small organic molecule
Emp. Form.:
C20H12FN3O8
Mol. Mass.:
441.323
SMILES:
OC(=O)c1ccc(Oc2cccc(F)c2NC(=O)c2cc(ccn2)[N+]([O-])=O)cc1C(O)=O
: