Target
Glycogen phosphorylase, muscle form
Ligand
BDBM50135553
Substrate
Meas. Tech.
ChEBML_70984
IC50
12±n/a nM
Citation
 Lu, ZBohn, JBergeron, RDeng, QEllsworth, KPGeissler, WMHarris, GMcCann, PEMcKeever, BMyers, RWSaperstein, RWilloughby, CAYao, JChapman, K A new class of glycogen phosphorylase inhibitors. Bioorg Med Chem Lett 13:4125-8 (2003)  
Target
Name:
Glycogen phosphorylase, muscle form
Synonyms:
Glycogen phosphorylase, muscle form Myophosphorylase PYGM_HUMAN
Type:
PROTEIN
Mol. Mass.:
97097.45
Organism:
Homo sapiens (Human)
Description:
ChEMBL_1449751
Residue:
842
  
Inhibitor
Name:
BDBM50135553
Synonyms:
4-{3-[(4-Chloro-pyridine-2-carbonyl)-amino]-naphthalen-2-yloxy}-phthalic acid | CHEMBL133832
Type:
Small organic molecule
Emp. Form.:
C24H15ClN2O6
Mol. Mass.:
462.839
SMILES:
OC(=O)c1ccc(Oc2cc3ccccc3cc2NC(=O)c2cc(Cl)ccn2)cc1C(O)=O
: